Target
Bromodomain-containing protein 4
Ligand
BDBM50365463
Substrate
Meas. Tech.
ChEMBL_1715829 (CHEMBL4130829)
IC50
260±n/a nM
Citation
 Hu, JWang, YLi, YXu, LCao, DSong, SDamaneh, MSWang, XMeng, TChen, YLShen, JMiao, ZXiong, B Discovery of a series of dihydroquinoxalin-2(1H)-ones as selective BET inhibitors from a dual PLK1-BRD4 inhibitor. Eur J Med Chem 137:176-195 (2017)  
Target
Name:
Bromodomain-containing protein 4
Synonyms:
BRD4 Bromodomain-containing protein 4 (BRD4) Protein HUNK1
Type:
Protein
Mol. Mass.:
152264.84
Organism:
Homo sapiens (Human)
Description:
O60885
Residue:
1362
  
Inhibitor
Name:
BDBM50365463
Synonyms:
CHEMBL1232461
Type:
Small organic molecule
Emp. Form.:
C22H22ClN5O2
Mol. Mass.:
423.895
SMILES:
CCNC(=O)C[C@@H]1N=C(c2ccc(Cl)cc2)c2cc(OC)ccc2-n2c(C)nnc12
: