Target
Amyloid-beta precursor protein
Ligand
BDBM50276883
Substrate
Meas. Tech.
ChEMBL_1717034 (CHEMBL4132034)
Ki
4.3±n/a nM
Citation
 Keri, RSChand, KBudagumpi, SBalappa Somappa, SPatil, SANagaraja, BM An overview of benzo[b]thiophene-based medicinal chemistry. Eur J Med Chem 138:1002-1033 (2017)  
Target
Name:
Amyloid-beta precursor protein
Synonyms:
A4 ABPP AICD-50 AICD-59 AID(57) APP Alzheimer disease amyloid protein Amyloid beta Protein Amyloid beta protein Abeta(1-42) Amyloid intracellular domain 57 Amyloid protein (Abeta42b) Beta amyloid A4 protein Beta-APP42 Beta-amyloid protein 42 C83 CVAP Gamma Secretase Gamma-CTF(57) Gamma-secretase Gamma-secretase C-terminal fragment 57 P3(40) PN-II Protease nexin-II S-APP-beta Soluble APP-beta | beta-Amyloid Precursor Protein (APP)
Type:
Single-pass type I membrane protein
Mol. Mass.:
86890.41
Organism:
Homo sapiens (Human)
Description:
P05067
Residue:
770
  
Inhibitor
Name:
BDBM50276883
Synonyms:
CHEMBL4175800
Type:
Small organic molecule
Emp. Form.:
C14H11NS
Mol. Mass.:
225.309
SMILES:
Nc1ccc(cc1)-c1cc2ccccc2s1
: