Target
Amyloid-beta precursor protein
Ligand
BDBM50276915
Substrate
Meas. Tech.
ChEBML_1717211
EC50
20600±n/a nM
Citation
 Taguchi, RHatayama, KTakahashi, THayashi, TSato, YSato, DOhta, KNakano, HSeki, CEndo, YTokuraku, KUwai, K Structure-activity relations of rosmarinic acid derivatives for the amyloid ? aggregation inhibition and antioxidant properties. Eur J Med Chem 138:1066-1075 (2017)  
Target
Name:
Amyloid-beta precursor protein
Synonyms:
A4 ABPP AICD-50 AICD-59 AID(57) APP Alzheimer disease amyloid protein Amyloid beta Protein Amyloid beta protein Abeta(1-42) Amyloid intracellular domain 57 Amyloid protein (Abeta42b) Beta amyloid A4 protein Beta-APP42 Beta-amyloid protein 42 C83 CVAP Gamma Secretase Gamma-CTF(57) Gamma-secretase Gamma-secretase C-terminal fragment 57 P3(40) PN-II Protease nexin-II S-APP-beta Soluble APP-beta | beta-Amyloid Precursor Protein (APP)
Type:
Single-pass type I membrane protein
Mol. Mass.:
86890.41
Organism:
Homo sapiens (Human)
Description:
P05067
Residue:
770
  
Inhibitor
Name:
BDBM50276915
Synonyms:
CHEMBL1088583 | Caffeic Acid 3,4-Dihydroxyphenethyl Ester
Type:
Small organic molecule
Emp. Form.:
C17H16O6
Mol. Mass.:
316.3053
SMILES:
Oc1ccc(CCOC(=O)\C=C\c2ccc(O)c(O)c2)cc1O
: