Target
Interleukin-5
Ligand
BDBM50277125
Substrate
Meas. Tech.
ChEBML_1717607
IC50
10000±n/a nM
Citation
 Boggu, PRVenkateswararao, EManickam, MKim, YJung, SH Discovery of novel 3-(hydroxyalkoxy)-2-alkylchromen-4-one analogs as interleukin-5 inhibitors. Eur J Med Chem 139:290-304 (2017)  
Target
Name:
Interleukin-5
Synonyms:
IL5_MOUSE Il5
Type:
PROTEIN
Mol. Mass.:
15414.97
Organism:
Mus musculus
Description:
ChEMBL_1464308
Residue:
133
  
Inhibitor
Name:
BDBM50277125
Synonyms:
CHEMBL4165527
Type:
Small organic molecule
Emp. Form.:
C19H24O4
Mol. Mass.:
316.3915
SMILES:
OCCCOc1coc2cccc(CC3CCCCC3)c2c1=O
: