Target
Dipeptidyl peptidase 4
Ligand
BDBM50178428
Substrate
Meas. Tech.
ChEBML_1717759
IC50
5400±n/a nM
Citation
 Rea, DVan Elzen, RDe Winter, HVan Goethem, SLanduyt, BLuyten, WSchoofs, LVan Der Veken, PAugustyns, KDe Meester, IFülöp, VLambeir, AM Crystal structure of Porphyromonas gingivalis dipeptidyl peptidase 4 and structure-activity relationships based on inhibitor profiling. Eur J Med Chem 139:482-491 (2017)  
Target
Name:
Dipeptidyl peptidase 4
Synonyms:
ADABP Adenosine deaminase complexing protein 2 CD_antigen=CD26 DPP4 DPPIV Dipeptidyl peptidase 4 (DPP IV) Dipeptidyl peptidase 4 (DPP4) Dipeptidyl peptidase 4 membrane form Dipeptidyl peptidase IV Dipeptidyl peptidase IV (DDP-IV) Dipeptidyl peptidase IV membrane form Dipeptidyl peptidase-IV (DPP-4) T-cell activation antigen CD26 | TP103
Type:
Enzyme
Mol. Mass.:
88271.01
Organism:
Homo sapiens (Human)
Description:
P27487
Residue:
766
  
Inhibitor
Name:
BDBM50178428
Synonyms:
(S)-2-amino-3-methyl-1-(pyrrolidin-1-yl)butan-1-one CHEMBL383705
Type:
Small organic molecule
Emp. Form.:
C9H18N2O
Mol. Mass.:
170.252
SMILES:
CC(C)[C@H](N)C(=O)N1CCCC1
: