Target
Broad substrate specificity ATP-binding cassette transporter ABCG2
Ligand
BDBM50277398
Substrate
Meas. Tech.
ChEMBL_1717975 (CHEMBL4132975)
EC50
12±n/a nM
Citation
 Krapf, MKGallus, JWiese, M Synthesis and biological investigation of 2,4-substituted quinazolines as highly potent inhibitors of breast cancer resistance protein (ABCG2). Eur J Med Chem 139:587-611 (2017)  
Target
Name:
Broad substrate specificity ATP-binding cassette transporter ABCG2
Synonyms:
ABCG2 ABCP ATP-binding cassette sub-family G member 2 ATP-binding cassette, sub-family G, member 2 BCRP1 CDw338 Mitoxantrone resistance-associated protein Urate exporter
Type:
Multi-pass membrane protein; monomer or homodimer; disulfide-linked
Mol. Mass.:
72329.48
Organism:
Homo sapiens (Human)
Description:
Q9UNQ0
Residue:
655
  
Inhibitor
Name:
BDBM50277398
Synonyms:
CHEMBL4171781
Type:
Small organic molecule
Emp. Form.:
C23H21N3O3
Mol. Mass.:
387.4311
SMILES:
COc1cccc(Nc2nc(nc3ccccc23)-c2ccc(OC)c(OC)c2)c1
: