Target
Broad substrate specificity ATP-binding cassette transporter ABCG2
Ligand
BDBM50444023
Substrate
Meas. Tech.
ChEMBL_1717958 (CHEMBL4132958)
IC50
44±n/a nM
Citation
 Krapf, MKGallus, JWiese, M Synthesis and biological investigation of 2,4-substituted quinazolines as highly potent inhibitors of breast cancer resistance protein (ABCG2). Eur J Med Chem 139:587-611 (2017)  
Target
Name:
Broad substrate specificity ATP-binding cassette transporter ABCG2
Synonyms:
ABCG2 ABCP ATP-binding cassette sub-family G member 2 ATP-binding cassette, sub-family G, member 2 BCRP1 CDw338 Mitoxantrone resistance-associated protein Urate exporter
Type:
Multi-pass membrane protein; monomer or homodimer; disulfide-linked
Mol. Mass.:
72329.48
Organism:
Homo sapiens (Human)
Description:
Q9UNQ0
Residue:
655
  
Inhibitor
Name:
BDBM50444023
Synonyms:
CHEMBL3092486
Type:
Small organic molecule
Emp. Form.:
C22H18N4O4
Mol. Mass.:
402.4027
SMILES:
COc1ccc(cc1OC)-c1nc(Nc2ccc(cc2)[N+]([O-])=O)c2ccccc2n1
: