Target
Butyrophilin subfamily 3 member A1
Ligand
BDBM50278623
Substrate
Meas. Tech.
ChEMBL_1719030 (CHEMBL4134030)
EC50
0.790000±n/a nM
Citation
 Foust, BJPoe, MMLentini, NAHsiao, CCWiemer, AJWiemer, DF Mixed Aryl Phosphonate Prodrugs of a Butyrophilin Ligand. ACS Med Chem Lett 8:914-918 (2017)  
Target
Name:
Butyrophilin subfamily 3 member A1
Synonyms:
BT3A1_HUMAN BTN3A1 CD_antigen=CD277
Type:
PROTEIN
Mol. Mass.:
57685.08
Organism:
Homo sapiens (Human)
Description:
ChEMBL_117363
Residue:
513
  
Inhibitor
Name:
BDBM50278623
Synonyms:
CHEMBL4160740
Type:
Small organic molecule
Emp. Form.:
C22H29O5P
Mol. Mass.:
404.4364
SMILES:
C\C(CO)=C/CCP(=O)(COC(=O)C(C)(C)C)Oc1cccc2ccccc12
: