Target
Delta(24)-sterol reductase
Ligand
BDBM50278872
Substrate
Meas. Tech.
ChEMBL_1719393 (CHEMBL4134393)
IC50
2.9±n/a nM
Citation
 Müller, CHemmers, SBartl, NPlodek, AKörner, AMirakaj, VGiera, MBracher, F New chemotype of selective and potent inhibitors of human delta 24-dehydrocholesterol reductase. Eur J Med Chem 140:305-320 (2017)  
Target
Name:
Delta(24)-sterol reductase
Synonyms:
1.3.1.72 3-beta-hydroxysteroid-Delta(8),Delta(7)-isomerase/Delta(24)-sterol reductase DHC24_HUMAN Delta(24)-sterol reductase KIAA0018 | Seladin-1
Type:
PROTEIN
Mol. Mass.:
60115.66
Organism:
Homo sapiens
Description:
ChEMBL_117046
Residue:
516
  
Inhibitor
Name:
BDBM50278872
Synonyms:
CHEMBL4170755
Type:
Small organic molecule
Emp. Form.:
C29H42INO
Mol. Mass.:
547.5544
SMILES:
[I-].[H][C@@]1(CC[C@@]2([H])C3=CC[C@@]4([H])C[C@@H](O)CC[C@]4(C)[C@@]3([H])CC[C@]12C)[C@H](C)\C=C\c1cc[n+](C)cc1
: