Target
Lysine-specific histone demethylase 2
Ligand
BDBM254603
Substrate
Meas. Tech.
ChEMBL_1720163 (CHEMBL4135163)
IC50
>100000±n/a nM
Citation
 Ji, YYLin, SDWang, YJSu, MBZhang, WGunosewoyo, HYang, FLi, JTang, JZhou, YBYu, LF Tying up tranylcypromine: Novel selective histone lysine specific demethylase 1 (LSD1) inhibitors. Eur J Med Chem 141:101-112 (2017)  
Target
Name:
Lysine-specific histone demethylase 2
Synonyms:
AOF1 Flavin-containing amine oxidase domain-containing protein 1 KDM1B_HUMAN Lysine-specific histone demethylase 1B | Lysine-specific histone demethylase 2
Type:
PROTEIN
Mol. Mass.:
92112.91
Organism:
Homo sapiens (Human)
Description:
ChEMBL_992590
Residue:
822
  
Inhibitor
Name:
BDBM254603
Synonyms:
US10214477, Example 5 US9670136, 3 (trans)-N1-((1S,2R)-2-phenylcyclopropyl)cyclohexane-1,4-diamine
Type:
Small organic molecule
Emp. Form.:
C15H22N2
Mol. Mass.:
230.3486
SMILES:
NC1CCC(CC1)N[C@@H]1C[C@H]1c1ccccc1
: