Target
Lysine-specific histone demethylase 1A
Ligand
BDBM50278460
Substrate
Meas. Tech.
ChEMBL_1720161 (CHEMBL4135161)
IC50
17±n/a nM
Citation
 Ji, YYLin, SDWang, YJSu, MBZhang, WGunosewoyo, HYang, FLi, JTang, JZhou, YBYu, LF Tying up tranylcypromine: Novel selective histone lysine specific demethylase 1 (LSD1) inhibitors. Eur J Med Chem 141:101-112 (2017)  
Target
Name:
Lysine-specific histone demethylase 1A
Synonyms:
AOF2 Flavin-containing amine oxidase domain-containing protein 2 KDM1A KIAA0601 Lysine-specific demethylase 1 (LSD1) Lysine-specific histone demethylase 1 (LSD1)
Type:
Enzyme
Mol. Mass.:
92901.01
Organism:
Homo sapiens (Human)
Description:
O60341
Residue:
852
  
Inhibitor
Name:
BDBM50278460
Synonyms:
CHEMBL4166129
Type:
Small organic molecule
Emp. Form.:
C16H23ClN2
Mol. Mass.:
278.82
SMILES:
Cl.[H][C@]12Cc3ccccc3[C@@]1([H])[C@]2([H])N[C@@H]1CC[C@H](N)CC1
: