Target
Phospholipase A2
Ligand
BDBM50242184
Substrate
Meas. Tech.
ChEMBL_1719916 (CHEMBL4134916)
IC50
70±n/a nM
Citation
 Starkus, JGPoerzgen, PLayugan, KKawabata, KGGoto, JISuzuki, SMyers, GKelly, MPenner, RFleig, AHorgen, FD Scalaradial Is a Potent Inhibitor of Transient Receptor Potential Melastatin 2 (TRPM2) Ion Channels. J Nat Prod 80:2741-2750 (2017)  
Target
Name:
Phospholipase A2
Synonyms:
Allergen Api m I PA2_APIME Phospholipase A2 (Bee)
Type:
PROTEIN
Mol. Mass.:
19061.47
Organism:
Apis mellifera
Description:
ChEMBL_1277435
Residue:
167
  
Inhibitor
Name:
BDBM50242184
Synonyms:
Scalaradial
Type:
Small organic molecule
Emp. Form.:
C27H40O4
Mol. Mass.:
428.6041
SMILES:
[H][C@@]12CC[C@@]3(C)[C@]4([H])CC=C(C=O)[C@H](C=O)[C@@]4(C)[C@H](C[C@]3([H])[C@@]1(C)CCCC2(C)C)OC(C)=O
: