Target
Metabotropic glutamate receptor 7
Ligand
BDBM50280371
Substrate
Meas. Tech.
ChEMBL_1721686 (CHEMBL4136686)
IC50
5800±n/a nM
Citation
 Reed, CWMcGowan, KMSpearing, PKStansley, BJRoenfanz, HFEngers, DWRodriguez, ALEngelberg, EMLuscombe, VBLoch, MTRemke, DHRook, JMBlobaum, ALConn, PJNiswender, CMLindsley, CW VU6010608, a Novel mGlu ACS Med Chem Lett 8:1326-1330 (2017)  
Target
Name:
Metabotropic glutamate receptor 7
Synonyms:
GRM7_RAT Grm7 Metabotropic glutamate receptor 7 (mGlu7) mGlu7
Type:
Enzyme
Mol. Mass.:
102244.48
Organism:
Rattus norvegicus (Rat)
Description:
P35400
Residue:
915
  
Inhibitor
Name:
BDBM50280371
Synonyms:
CHEMBL4160779
Type:
Small organic molecule
Emp. Form.:
C17H15ClN4O3
Mol. Mass.:
358.779
SMILES:
COc1ccc(cc1OC)C(=O)Nc1cc(Cl)ccc1-n1cncn1
: