Target
5-hydroxytryptamine receptor 1B
Ligand
BDBM81497
Substrate
Meas. Tech.
ChEBML_1768
IC50
150±n/a nM
Citation
 Macor, JEBurkhart, CAHeym, JHIves, JLLebel, LANewman, MENielsen, JARyan, KSchulz, DWTorgersen, LK 3-(1,2,5,6-Tetrahydropyrid-4-yl)pyrrolo[3,2-b]pyrid-5-one: a potent and selective serotonin (5-HT1B) agonist and rotationally restricted phenolic analogue of 5-methoxy-3-(1,2,5,6-tetrahydropyrid-4-yl)indole. J Med Chem 33:2087-93 (1990)  
Target
Name:
5-hydroxytryptamine receptor 1B
Synonyms:
5-HT-1B 5-hydroxytryptamine receptor 1B (5HT1B) 5ht1b Serotonin 1 (5-HT1) receptor Serotonin receptor 1B
Type:
Protein
Mol. Mass.:
43173.33
Organism:
Rattus norvegicus (Rat)
Description:
P28564
Residue:
386
  
Inhibitor
Name:
BDBM81497
Synonyms:
4-(4-Methyl-piperazin-1-yl)-7-trifluoromethyl-pyrrolo[1,2-a]quinoxaline CGS 12066B NSC_123945
Type:
Small organic molecule
Emp. Form.:
C17H17F3N4
Mol. Mass.:
334.3389
SMILES:
CN1CCN(CC1)c1nc2cc(ccc2n2cccc12)C(F)(F)F
: