Target
5-hydroxytryptamine receptor 1A
Ligand
BDBM31023
Substrate
Meas. Tech.
ChEBML_872
IC50
140±n/a nM
Citation
 Macor, JEBurkhart, CAHeym, JHIves, JLLebel, LANewman, MENielsen, JARyan, KSchulz, DWTorgersen, LK 3-(1,2,5,6-Tetrahydropyrid-4-yl)pyrrolo[3,2-b]pyrid-5-one: a potent and selective serotonin (5-HT1B) agonist and rotationally restricted phenolic analogue of 5-methoxy-3-(1,2,5,6-tetrahydropyrid-4-yl)indole. J Med Chem 33:2087-93 (1990)  
Target
Name:
5-hydroxytryptamine receptor 1A
Synonyms:
5-HT-1A 5-HT1A 5-hydroxytryptamine receptor 1A (5HT1A) 5ht1a Htr1a Serotonin 1a (5-HT1a) receptor/Adrenergic receptor alpha-1 | Serotonin receptor 1A
Type:
G Protein-Coupled Receptor (GPCR)
Mol. Mass.:
46445.29
Organism:
Rattus norvegicus (rat)
Description:
Binding assays were performed using rat hippocampal membranes.
Residue:
422
  
Inhibitor
Name:
BDBM31023
Synonyms:
3-(1,2,3,6-tetrahydropyridin-4-yl)-1H-indole CHEMBL27811 SMR000029333 | cid_2761023
Type:
Small organic molecule
Emp. Form.:
C13H14N2
Mol. Mass.:
198.2637
SMILES:
C1CC(=CCN1)c1c[nH]c2ccccc12
: