Target
Glutamate receptor ionotropic, NMDA 2C
Ligand
BDBM50015730
Substrate
Meas. Tech.
ChEMBL_154223 (CHEMBL759468)
Ki
422.0±n/a nM
Citation
 Thurkauf, Ade Costa, BMattson, MVFrance, CPPrice, MTOlney, JWWoods, JHJacobson, AERice, KC Synthesis, phencyclidine-like pharmacology, and antiischemic potential of meta-substituted 1-(1-phenylcyclohexyl)-1,2,3,6-tetrahydropyridines. J Med Chem 33:2211-5 (1990)  
Target
Name:
Glutamate receptor ionotropic, NMDA 2C
Synonyms:
Glutamate NMDA receptor; Grin1/Grin2c Grin2c NMDE3_RAT
Type:
Protein
Mol. Mass.:
135305.94
Organism:
Rattus norvegicus (Rat)
Description:
Q00961
Residue:
1237
  
Inhibitor
Name:
BDBM50015730
Synonyms:
1-[1-(3-Trifluoromethyl-phenyl)-cyclohexyl]-1,2,3,6-tetrahydro-pyridine (HCl) | CHEMBL68156
Type:
Small organic molecule
Emp. Form.:
C18H22F3N
Mol. Mass.:
309.3692
SMILES:
FC(F)(F)c1cccc(c1)C1(CCCCC1)N1CCC=CC1
: