Target
ALK tyrosine kinase receptor
Ligand
BDBM50436850
Substrate
Meas. Tech.
ChEMBL_1721453 (CHEMBL4136453)
IC50
3.4±n/a nM
Citation
 Wang, YChen, SHu, GWang, JGou, WZuo, DGu, YGong, PZhai, X Discovery of novel 2,4-diarylaminopyrimidine analogues as ALK and ROS1 dual inhibitors to overcome crizotinib-resistant mutants including G1202R. Eur J Med Chem 143:123-136 (2018)  
Target
Name:
ALK tyrosine kinase receptor
Synonyms:
ALK ALK_HUMAN CD_antigen: CD246
Type:
Protein
Mol. Mass.:
176453.10
Organism:
Homo sapiens (Human)
Description:
Q9UM73
Residue:
1620
  
Inhibitor
Name:
BDBM50436850
Synonyms:
CERITINIB LDK378 US10618884, Example 16 | US9809572, Example 16
Type:
Small organic molecule
Emp. Form.:
C28H36ClN5O3S
Mol. Mass.:
558.135
SMILES:
CC(C)Oc1cc(C2CCNCC2)c(C)cc1Nc1ncc(Cl)c(Nc2ccccc2S(=O)(=O)C(C)C)n1
: