Target
Vitamin D3 receptor
Ligand
BDBM50281163
Substrate
Meas. Tech.
ChEMBL_1722372 (CHEMBL4137372)
IC50
1.9±n/a nM
Citation
 Yoshizawa, MItoh, THori, TKato, AAnami, YYoshimoto, NYamamoto, K Identification of the Histidine Residue in Vitamin D Receptor That Covalently Binds to Electrophilic Ligands. J Med Chem 61:6339-6349 (2018)  
Target
Name:
Vitamin D3 receptor
Synonyms:
1,25-dihydroxyvitamin D3 receptor Nuclear receptor subfamily 1 group I member 1 VDR | VDR_HUMAN
Type:
Protein
Mol. Mass.:
48288.72
Organism:
Homo sapiens (Human)
Description:
P11473
Residue:
427
  
Inhibitor
Name:
BDBM50281163
Synonyms:
CHEMBL4166076
Type:
Small organic molecule
Emp. Form.:
C29H40O3
Mol. Mass.:
436.6261
SMILES:
[H][C@@]1([#6]-[#6][C@@]2([H])\[#6](-[#6]-[#6]-[#6][C@]12[#6])=[#6]\[#6]=[#6]-1\[#6]-[#6@@H](-[#8])-[#6](=[#6])-[#6@H](-[#8])-[#6]-1)[#6@H](-[#6])-[#6]-[#6]-[#6](=O)C#C\[#6]=[#6]\[#6]
: