Target
Vitamin D3 receptor
Ligand
BDBM50281390
Substrate
Meas. Tech.
ChEMBL_1722799 (CHEMBL4137799)
IC50
0.240000±n/a nM
Citation
 Otero, RIshizawa, MNumoto, NIkura, TIto, NTokiwa, HMouriņo, AMakishima, MYamada, S 25 S-Adamantyl-23-yne-26,27-dinor-1?,25-dihydroxyvitamin D J Med Chem 61:6658-6673 (2018)  
Target
Name:
Vitamin D3 receptor
Synonyms:
1,25-dihydroxyvitamin D3 receptor Nuclear receptor subfamily 1 group I member 1 VDR | VDR_HUMAN
Type:
Protein
Mol. Mass.:
48288.72
Organism:
Homo sapiens (Human)
Description:
P11473
Residue:
427
  
Inhibitor
Name:
BDBM50281390
Synonyms:
CHEMBL4159525
Type:
Small organic molecule
Emp. Form.:
C35H50O3
Mol. Mass.:
518.7697
SMILES:
[H][C@@]1(CC[C@@]2([H])\C(CCC[C@]12C)=C\C=C1\C[C@@H](O)C[C@H](O)C1=C)[C@H](C)CC#C[C@@H](O)C12CC3CC(CC(C3)C1)C2
: