Target
Neutrophil elastase
Ligand
BDBM50015885
Substrate
Meas. Tech.
ChEBML_63806
IC50
40±n/a nM
Citation
 Doherty, JBAshe, BMBarker, PLBlacklock, TJButcher, JWChandler, GODahlgren, MEDavies, PDorn, CPFinke, PE Inhibition of human leukocyte elastase. 1. Inhibition by C-7-substituted cephalosporin tert-butyl esters. J Med Chem 33:2513-21 (1990)  
Target
Name:
Neutrophil elastase
Synonyms:
Bone marrow serine protease Coagulation factor X ELANE Elastase HLE Leukocyte elastase Medullasin Neutrophil elastase (HNE) PMN elastase Trypsin
Type:
Enzyme
Mol. Mass.:
28532.38
Organism:
Homo sapiens (Human)
Description:
P08246
Residue:
267
  
Inhibitor
Name:
BDBM50015885
Synonyms:
3-Acetoxymethyl-7-chloro-5,5,8-trioxo-5lambda*6*-thia-1-aza-bicyclo[4.2.0]oct-2-ene-2-carboxylic acid tert-butyl ester | CHEMBL314476
Type:
Small organic molecule
Emp. Form.:
C14H18ClNO7S
Mol. Mass.:
379.813
SMILES:
CC(=O)OCC1=C(N2[C@@H]([C@@H](Cl)C2=O)S(=O)(=O)C1)C(=O)OC(C)(C)C
: