Target
Alpha-1B adrenergic receptor
Ligand
BDBM50282201
Substrate
Meas. Tech.
ChEMBL_1723941 (CHEMBL4139219)
Ki
55±n/a nM
Citation
 Maestri, VTarozzi, ASimoni, ECilia, APoggesi, ENaldi, MNicolini, BPruccoli, LRosini, MMinarini, A Quinazoline based ? Eur J Med Chem 136:259-269 (2017)  
Target
Name:
Alpha-1B adrenergic receptor
Synonyms:
ADA1B_HUMAN Adrenergic alpha1B Adrenergic receptor alpha Alpha 1B-adrenoreceptor | Alpha-1B adrenergic receptor
Type:
Enzyme
Mol. Mass.:
56862.13
Organism:
Homo sapiens (Human)
Description:
P35368
Residue:
520
  
Inhibitor
Name:
BDBM50282201
Synonyms:
CHEMBL4163810
Type:
Small organic molecule
Emp. Form.:
C15H21N5O2
Mol. Mass.:
303.3595
SMILES:
COc1cc2nc(nc(N)c2cc1OC)N1CCC[C@H](N)C1
: