Target
Alpha-1B adrenergic receptor
Ligand
BDBM50282198
Substrate
Meas. Tech.
ChEMBL_1723941 (CHEMBL4139219)
Ki
47±n/a nM
Citation
 Maestri, VTarozzi, ASimoni, ECilia, APoggesi, ENaldi, MNicolini, BPruccoli, LRosini, MMinarini, A Quinazoline based ? Eur J Med Chem 136:259-269 (2017)  
Target
Name:
Alpha-1B adrenergic receptor
Synonyms:
ADA1B_HUMAN Adrenergic alpha1B Adrenergic receptor alpha Alpha 1B-adrenoreceptor | Alpha-1B adrenergic receptor
Type:
Enzyme
Mol. Mass.:
56862.13
Organism:
Homo sapiens (Human)
Description:
P35368
Residue:
520
  
Inhibitor
Name:
BDBM50282198
Synonyms:
CHEMBL4159468
Type:
Small organic molecule
Emp. Form.:
C24H27N5O5
Mol. Mass.:
465.5017
SMILES:
COc1cc2nc(nc(N)c2cc1OC)N1CCC[C@H](C1)NC(=O)[C@H]1COc2ccccc2O1
: