Target
Alpha-1B adrenergic receptor
Ligand
BDBM50282204
Substrate
Meas. Tech.
ChEMBL_1723941 (CHEMBL4139219)
Ki
0.281838±n/a nM
Citation
 Maestri, VTarozzi, ASimoni, ECilia, APoggesi, ENaldi, MNicolini, BPruccoli, LRosini, MMinarini, A Quinazoline based ? Eur J Med Chem 136:259-269 (2017)  
Target
Name:
Alpha-1B adrenergic receptor
Synonyms:
ADA1B_HUMAN Adrenergic alpha1B Adrenergic receptor alpha Alpha 1B-adrenoreceptor | Alpha-1B adrenergic receptor
Type:
Enzyme
Mol. Mass.:
56862.13
Organism:
Homo sapiens (Human)
Description:
P35368
Residue:
520
  
Inhibitor
Name:
BDBM50282204
Synonyms:
CHEMBL4161165
Type:
Small organic molecule
Emp. Form.:
C20H23N5O4
Mol. Mass.:
397.4277
SMILES:
COc1cc2nc(nc(N)c2cc1OC)N1CCC[C@@H](C1)NC(=O)c1ccco1
: