Target
Alpha-1B adrenergic receptor
Ligand
BDBM29568
Substrate
Meas. Tech.
ChEMBL_1723941 (CHEMBL4139219)
Ki
0.407380±n/a nM
Citation
 Maestri, VTarozzi, ASimoni, ECilia, APoggesi, ENaldi, MNicolini, BPruccoli, LRosini, MMinarini, A Quinazoline based ? Eur J Med Chem 136:259-269 (2017)  
Target
Name:
Alpha-1B adrenergic receptor
Synonyms:
ADA1B_HUMAN Adrenergic alpha1B Adrenergic receptor alpha Alpha 1B-adrenoreceptor | Alpha-1B adrenergic receptor
Type:
Enzyme
Mol. Mass.:
56862.13
Organism:
Homo sapiens (Human)
Description:
P35368
Residue:
520
  
Inhibitor
Name:
BDBM29568
Synonyms:
CHEMBL2 PRAZOSIN HYDROCHLORIDE [3H]-Minipress [3H]-Prazosin
Type:
radiolabeled ligand
Emp. Form.:
C19H21N5O4
Mol. Mass.:
383.4011
SMILES:
COc1cc2nc(nc(N)c2cc1OC)N1CCN(CC1)C(=O)c1ccco1
: