Target
Kelch-like ECH-associated protein 1
Ligand
BDBM50283796
Substrate
Meas. Tech.
ChEMBL_1726328 (CHEMBL4141606)
Kd
87±n/a nM
Citation
 Lu, MCJiao, QLiu, TTan, SJZhou, HSYou, QDJiang, ZY Discovery of a head-to-tail cyclic peptide as the Keap1-Nrf2 protein-protein interaction inhibitor with high cell potency. Eur J Med Chem 143:1578-1589 (2018)  
Target
Name:
Kelch-like ECH-associated protein 1
Synonyms:
Cytosolic inhibitor of Nrf2 KEAP1 KEAP1_HUMAN KLHL19 | Kelch-like protein 19
Type:
PROTEIN
Mol. Mass.:
69664.53
Organism:
Homo sapiens (Human)
Description:
ChEMBL_107924
Residue:
624
  
Inhibitor
Name:
BDBM50283796
Synonyms:
CHEMBL4174405
Type:
Small organic molecule
Emp. Form.:
C55H82N12O21
Mol. Mass.:
1247.3074
SMILES:
CC(C)C[C@H](NC(=O)[C@H](Cc1ccccc1)NC(=O)[C@H](CCC(O)=O)NC(=O)CNC(=O)[C@@H](NC(=O)[C@H](CCC(O)=O)NC(=O)[C@@H]1CCCN1C(=O)[C@H](CC(O)=O)NC(=O)[C@H](CC(C)C)NC(=O)[C@H](CCC(N)=O)NC(=O)CNC(C)=O)[C@@H](C)O)C(O)=O
: