Target
Egl nine homolog 1
Ligand
BDBM50193145
Substrate
Meas. Tech.
ChEMBL_1728899 (CHEMBL4144177)
IC50
7500±n/a nM
Citation
 Ogoshi, YMatsui, TMitani, IYokota, MTerashita, MMotoda, DUeyama, KHotta, TIto, THase, YFukui, KDeai, KYoshiuchi, HIto, SAbe, H Discovery of JTZ-951: A HIF Prolyl Hydroxylase Inhibitor for the Treatment of Renal Anemia. ACS Med Chem Lett 8:1320-1325 (2017)  
Target
Name:
Egl nine homolog 1
Synonyms:
C1orf12 EGLN1_HUMAN Hypoxia-inducible factor prolyl hydroxylase 2 (HIF-PH2) Prolyl hydroxylase domain-containing protein 2 (PHD2)
Type:
Protein
Mol. Mass.:
46035.59
Organism:
Homo sapiens (Human)
Description:
Q9GZT9
Residue:
426
  
Inhibitor
Name:
BDBM50193145
Synonyms:
2-(1-chloro-4-hydroxyisoquinoline-3-carboxamido)acetic acid Isoquinoline 3 | N-[(1-CHLORO-4-HYDROXYISOQUINOLIN-3-YL)CARBONYL]GLYCINE
Type:
Small organic molecule
Emp. Form.:
C12H9ClN2O4
Mol. Mass.:
280.664
SMILES:
OC(=O)CNC(=O)c1nc(Cl)c2ccccc2c1O
: