Target
Cytochrome P450 2C9
Ligand
BDBM50286423
Substrate
Meas. Tech.
ChEMBL_1729069 (CHEMBL4144347)
IC50
1600±n/a nM
Citation
 Michaelides, MRKluge, APatane, MVan Drie, JHWang, CHansen, TMRisi, RMMantei, RHertel, CKarukurichi, KNesterov, AMcElligott, Dde Vries, PLangston, JWCole, PAMarmorstein, RLiu, HLasko, LBromberg, KDLai, AKesicki, EA Discovery of Spiro Oxazolidinediones as Selective, Orally Bioavailable Inhibitors of p300/CBP Histone Acetyltransferases. ACS Med Chem Lett 9:28-33 (2018)  
Target
Name:
Cytochrome P450 2C9
Synonyms:
(R)-limonene 6-monooxygenase CP2C9_HUMAN CYP2C9 Cytochrome P450 2C9 (CYP2C9 ) P-450MP P450 PB-1 | S-mephenytoin 4-hydroxylase
Type:
Enzyme
Mol. Mass.:
55636.33
Organism:
Homo sapiens (Human)
Description:
P11712
Residue:
490
  
Inhibitor
Name:
BDBM50286423
Synonyms:
CHEMBL4174931
Type:
Small organic molecule
Emp. Form.:
C25H25F3N4O5
Mol. Mass.:
518.485
SMILES:
CNC(=O)Nc1ccc2c(CC[C@@]22OC(=O)N(CC(=O)N(Cc3ccccc3)[C@@H](C)C(F)(F)F)C2=O)c1
: