Target
Nuclear receptor corepressor 1
Ligand
BDBM50286560
Substrate
Meas. Tech.
ChEMBL_1729071 (CHEMBL4144349)
IC50
4.1±n/a nM
Citation
 Chen, WDong, GWu, YZhang, WMiao, CSheng, C Dual NAMPT/HDAC Inhibitors as a New Strategy for Multitargeting Antitumor Drug Discovery. ACS Med Chem Lett 9:34-38 (2018)  
Target
Name:
Nuclear receptor corepressor 1
Synonyms:
KIAA1047 N-CoR1 NCOR1_HUMAN
Type:
PROTEIN
Mol. Mass.:
270226.27
Organism:
Homo sapiens (Human)
Description:
ChEMBL_107910
Residue:
2440
  
Inhibitor
Name:
BDBM50286560
Synonyms:
CHEMBL4163681
Type:
Small organic molecule
Emp. Form.:
C24H31FN6O3S
Mol. Mass.:
502.605
SMILES:
ONC(=O)CCCCCCN(Cc1ccc(F)cc1)c1ncc(s1)C(=O)NCCCn1ccnc1
: