Target
cGMP-dependent 3',5'-cyclic phosphodiesterase
Ligand
BDBM50263791
Substrate
Meas. Tech.
ChEMBL_1729499 (CHEMBL4144777)
IC50
0.400000±n/a nM
Citation
 Stepan, AFTran, TPHelal, CJBrown, MSChang, CO'Connor, REDe Vivo, MDoran, SDFisher, ELJenkinson, SKaranian, DKormos, BLSharma, RWalker, GSWright, ASYang, EXBrodney, MAWager, TTVerhoest, PRObach, RS Late-Stage Microsomal Oxidation Reduces Drug-Drug Interaction and Identifies Phosphodiesterase 2A Inhibitor PF-06815189. ACS Med Chem Lett 9:68-72 (2018)  
Target
Name:
cGMP-dependent 3',5'-cyclic phosphodiesterase
Synonyms:
CGS-PDE Homo sapiens phosphodiesterase 2A (PDE2A) PDE2A cGSPDE
Type:
Enzyme Catalytic Domain
Mol. Mass.:
105691.58
Organism:
Homo sapiens (Human)
Description:
O00408
Residue:
941
  
Inhibitor
Name:
BDBM50263791
Synonyms:
CHEMBL4062397
Type:
Small organic molecule
Emp. Form.:
C19H17F3N6O2
Mol. Mass.:
418.3725
SMILES:
Cc1nn(C)c(c1-c1nc(CO)c2n1nc(C)[nH]c2=O)-c1ccc(cc1)C(F)(F)F
: