Target
Leucine--tRNA ligase
Ligand
BDBM50286765
Substrate
Meas. Tech.
ChEMBL_1729552 (CHEMBL4144830)
IC50
23±n/a nM
Citation
 Charlton, MHAleksis, RSaint-Leger, AGupta, ALoza, ERibas de Pouplana, LKaula, IGustina, DMadre, MLola, DJaudzems, KEdmund, GRandall, CPKime, LO'Neill, AJGoessens, WJirgensons, AFinn, PW -Leucinyl Benzenesulfonamides as Structurally Simplified Leucyl-tRNA Synthetase Inhibitors. ACS Med Chem Lett 9:84-88 (2018)  
Target
Name:
Leucine--tRNA ligase
Synonyms:
6.1.1.4 Leucine--tRNA ligase SYL_ECOLI | leuS
Type:
PROTEIN
Mol. Mass.:
97211.51
Organism:
Escherichia coli (strain K12)
Description:
ChEMBL_117811
Residue:
860
  
Inhibitor
Name:
BDBM50286765
Synonyms:
CHEMBL4159778
Type:
Small organic molecule
Emp. Form.:
C17H22N4O3S
Mol. Mass.:
362.447
SMILES:
CC(C)C[C@H](N)C(=O)NS(=O)(=O)c1cccc(c1)-c1cccc(N)n1
: