Target
IgA-specific serine endopeptidase autotransporter
Ligand
BDBM50016712
Substrate
Meas. Tech.
ChEBML_88880
IC50
5300±n/a nM
Citation
 Wood, SGLynch, MPlaut, AGBurton, J Tetrapeptide inhibitors of the IgA1 proteinases from type I Neisseria gonorrhoeae. J Med Chem 32:2407-11 (1989)  
Target
Name:
IgA-specific serine endopeptidase autotransporter
Synonyms:
IGA_NEIGO iga
Type:
PROTEIN
Mol. Mass.:
169014.39
Organism:
Neisseria gonorrhoeae
Description:
ChEMBL_88881
Residue:
1532
  
Inhibitor
Name:
BDBM50016712
Synonyms:
1-{3-Hydroxy-2-[(pyrrolidine-2-carbonyl)-amino]-butyryl}-pyrrolidine-2-carboxylic acid (1-carbamoyl-2-hydroxy-ethyl)-amide | CHEMBL311666
Type:
Small organic molecule
Emp. Form.:
C17H29N5O6
Mol. Mass.:
399.4421
SMILES:
C[C@@H](O)[C@H](NC(=O)[C@H]1CCCN1)C(=O)N1CCC[C@@H]1C(=O)N[C@@H](CO)C(N)=O
: