Target
Alpha-2A adrenergic receptor
Ligand
BDBM50016883
Substrate
Meas. Tech.
ChEBML_33027
IC50
362±n/a nM
Citation
 Hutchison, AWilliams, Mde Jesus, RStone, GASylvester, LClarke, FHSills, MA 2H-[1]benzopyrano[3,4-b]pyridines: synthesis and activity at central monoamine receptors. J Med Chem 32:720-7 (1989)  
Target
Name:
Alpha-2A adrenergic receptor
Synonyms:
ADA2A_BOVIN Alpha-2A adrenergic receptor Alpha-2A adrenoreceptor Alpha-2D adrenergic receptor Cerebral cortex alpha adrenergic receptor adrenergic Alpha2D
Type:
Enzyme Catalytic Domain
Mol. Mass.:
49275.13
Organism:
BOVINE
Description:
adrenergic Alpha2 0 BOVINE::Q28838
Residue:
452
  
Inhibitor
Name:
BDBM50016883
Synonyms:
1-Propyl-2,3,4,4a,10,10a-hexahydro-1H-9-oxa-1-aza-phenanthren-5-ol | CHEMBL161947
Type:
Small organic molecule
Emp. Form.:
C15H21NO2
Mol. Mass.:
247.3327
SMILES:
CCCN1CCC[C@H]2[C@H]1COc1cccc(O)c21
: