Target
Alpha-2A adrenergic receptor
Ligand
BDBM50016897
Substrate
Meas. Tech.
ChEMBL_33027 (CHEMBL643952)
IC50
2±n/a nM
Citation
 Hutchison, AWilliams, Mde Jesus, RStone, GASylvester, LClarke, FHSills, MA 2H-[1]benzopyrano[3,4-b]pyridines: synthesis and activity at central monoamine receptors. J Med Chem 32:720-7 (1989)  
Target
Name:
Alpha-2A adrenergic receptor
Synonyms:
ADA2A_BOVIN Alpha-2A adrenergic receptor Alpha-2A adrenoreceptor Alpha-2D adrenergic receptor Cerebral cortex alpha adrenergic receptor adrenergic Alpha2D
Type:
Enzyme Catalytic Domain
Mol. Mass.:
49275.13
Organism:
BOVINE
Description:
adrenergic Alpha2 0 BOVINE::Q28838
Residue:
452
  
Inhibitor
Name:
BDBM50016897
Synonyms:
2-(2,6-dichloroanilino)-1,3-diazacyclopentene-(2) CLONIDINE clonidine (amino form)
Type:
Small organic molecule
Emp. Form.:
C9H9Cl2N3
Mol. Mass.:
230.094
SMILES:
Clc1cccc(Cl)c1\[#7]=[#6]-1\[#7]-[#6]-[#6]-[#7]-1
: