Target
Receptor-type tyrosine-protein phosphatase F
Ligand
BDBM50282483
Substrate
Meas. Tech.
ChEMBL_1730829 (CHEMBL4146365)
IC50
6950±n/a nM
Citation
 Du, YZhang, YLing, HLi, QShen, J Discovery of novel high potent and cellular active ADC type PTP1B inhibitors with selectivity over TC-PTP via modification interacting with C site. Eur J Med Chem 144:692-700 (2018)  
Target
Name:
Receptor-type tyrosine-protein phosphatase F
Synonyms:
LAR Leukocyte common antigen related (LAR) PTPRF_HUMAN Receptor-type tyrosine-protein phosphatase F (LAR)
Type:
Protein
Mol. Mass.:
212869.85
Organism:
Homo sapiens (Human)
Description:
P10586
Residue:
1907
  
Inhibitor
Name:
BDBM50282483
Synonyms:
CHEMBL4161709
Type:
Small organic molecule
Emp. Form.:
C29H36N4O7S
Mol. Mass.:
584.684
SMILES:
CCOc1cc(NS(C)(=O)=O)c(OCC)cc1CNC(=O)Nc1ccc(OCC)c(c1)C(=O)Nc1ccc(C)cc1
: