Target
Polyunsaturated fatty acid 5-lipoxygenase
Ligand
BDBM50016992
Substrate
Meas. Tech.
ChEBML_157778
IC50
76±n/a nM
Citation
 Lau, CKBélanger, PCScheigetz, JDufresne, CWilliams, HWMaycock, ALGuindon, YBach, TDallob, ALDenis, D Synthesis and structure-activity relationships of a novel class of 5-lipoxygenase inhibitors. 2-(Phenylmethyl)-4-hydroxy-3,5-dialkylbenzofurans: the development of L-656,224. J Med Chem 32:1190-7 (1989)  
Target
Name:
Polyunsaturated fatty acid 5-lipoxygenase
Synonyms:
5-LO 5-Lipoxygenase (5-LO) 5-Lipoygenase ALOX5 LOG5 | LOX5_HUMAN
Type:
Enzyme
Mol. Mass.:
77972.74
Organism:
Homo sapiens (Human)
Description:
Recombinant protein was purified from E. coli lysate. After ammonium sulfate precipitation and subsequent steps, the supernatant (S100) was used for 5-LO activity assay.
Residue:
674
  
Inhibitor
Name:
BDBM50016992
Synonyms:
7-Chloro-5-(3-hydroxy-propyl)-2-(4-methoxy-benzyl)-3-methyl-benzofuran-4-ol | CHEMBL18376
Type:
Small organic molecule
Emp. Form.:
C20H21ClO4
Mol. Mass.:
360.831
SMILES:
COc1ccc(Cc2oc3c(Cl)cc(CCCO)c(O)c3c2C)cc1
: