Target
Neuromedin-U receptor 2
Ligand
BDBM50291714
Substrate
Meas. Tech.
ChEMBL_1731395 (CHEMBL4146931)
EC50
0.700000±n/a nM
Citation
 De Prins, AMartin, CVan Wanseele, YSkov, LJTömböly, CTourwé, DCaveliers, VVan Eeckhaut, AHolst, BRosenkilde, MMSmolders, IBallet, S Development of potent and proteolytically stable human neuromedin U receptor agonists. Eur J Med Chem 144:887-897 (2018)  
Target
Name:
Neuromedin-U receptor 2
Synonyms:
G-protein coupled receptor FM-4 NMU-R2 NMU2R NMUR2_HUMAN TGR1
Type:
PROTEIN
Mol. Mass.:
47710.86
Organism:
Homo sapiens (Human)
Description:
ChEMBL_103075
Residue:
415
  
Inhibitor
Name:
BDBM50291714
Synonyms:
CHEMBL4177021
Type:
Small organic molecule
Emp. Form.:
C58H84N16O11
Mol. Mass.:
1181.3882
SMILES:
CC(C)C[C@H](NC(=O)[C@H](Cc1ccccc1)NC(=O)[C@H](Cc1c(C)cc(O)cc1C)NC(C)=O)C(=O)N[C@@H](Cc1ccccc1)C(=O)N[C@@H](CCCNC(N)=N)C(=O)N1CCC[C@H]1C(=O)N[C@@H](CCCNC(N)=N)C(=O)N[C@@H](CC(N)=O)C(N)=O
: