Target
Neuromedin-U receptor 1
Ligand
BDBM50291718
Substrate
Meas. Tech.
ChEMBL_1731393 (CHEMBL4146929)
EC50
5.1±n/a nM
Citation
 De Prins, AMartin, CVan Wanseele, YSkov, LJTömböly, CTourwé, DCaveliers, VVan Eeckhaut, AHolst, BRosenkilde, MMSmolders, IBallet, S Development of potent and proteolytically stable human neuromedin U receptor agonists. Eur J Med Chem 144:887-897 (2018)  
Target
Name:
Neuromedin-U receptor 1
Synonyms:
G-protein coupled receptor 66 GPR66 NMUR1 Neuromedin-U receptor 1
Type:
PROTEIN
Mol. Mass.:
47370.42
Organism:
Homo sapiens (Human)
Description:
ChEMBL_103121
Residue:
426
  
Inhibitor
Name:
BDBM50291718
Synonyms:
CHEMBL4174679
Type:
Small organic molecule
Emp. Form.:
C57H80N16O11
Mol. Mass.:
1165.3457
SMILES:
CC(C)C[C@H](NC(=O)[C@H](Cc1ccccc1)NC(=O)[C@@H]1Cc2ccc(O)cc2CN1C(C)=O)C(=O)N[C@@H](Cc1ccccc1)C(=O)N[C@@H](CCCNC(N)=N)C(=O)N1CCC[C@H]1C(=O)N[C@@H](CCCNC(N)=N)C(=O)N[C@@H](CC(N)=O)C(N)=O
: