Target
cGMP-specific 3',5'-cyclic phosphodiesterase
Ligand
BDBM50017103
Substrate
Meas. Tech.
ChEMBL_216655 (CHEMBL821136)
IC50
5000±n/a nM
Citation
 Marivet, MCBourguignon, JJLugnier, CMann, AStoclet, JCWermuth, CG Inhibition of cyclic adenosine-3',5'-monophosphate phosphodiesterase from vascular smooth muscle by rolipram analogues. J Med Chem 32:1450-7 (1989)  
Target
Name:
cGMP-specific 3',5'-cyclic phosphodiesterase
Synonyms:
PDE5 PDE5A_BOVIN | Phosphodiesterase 5A
Type:
PROTEIN
Mol. Mass.:
98615.45
Organism:
Bos taurus
Description:
ChEMBL_155186
Residue:
865
  
Inhibitor
Name:
BDBM50017103
Synonyms:
9,10-Dimethoxy-3-methyl-2-(2,4,6-trimethyl-phenylimino)-2,3,6,7-tetrahydro-pyrimido[6,1-a]isoquinolin-4-one CHEMBL285913 | Trequinsin
Type:
Small organic molecule
Emp. Form.:
C24H27N3O3
Mol. Mass.:
405.4895
SMILES:
COc1cc2CCn3c(c\c(=N/c4c(C)cc(C)cc4C)n(C)c3=O)-c2cc1OC
: