Target
cGMP-specific 3',5'-cyclic phosphodiesterase
Ligand
BDBM50017101
Substrate
Meas. Tech.
ChEMBL_216654 (CHEMBL821135)
IC50
>1000000±n/a nM
Citation
 Marivet, MCBourguignon, JJLugnier, CMann, AStoclet, JCWermuth, CG Inhibition of cyclic adenosine-3',5'-monophosphate phosphodiesterase from vascular smooth muscle by rolipram analogues. J Med Chem 32:1450-7 (1989)  
Target
Name:
cGMP-specific 3',5'-cyclic phosphodiesterase
Synonyms:
PDE5 PDE5A_BOVIN | Phosphodiesterase 5A
Type:
PROTEIN
Mol. Mass.:
98615.45
Organism:
Bos taurus
Description:
ChEMBL_155186
Residue:
865
  
Inhibitor
Name:
BDBM50017101
Synonyms:
7,8-Dimethoxy-1,2,3a,4,5,9b-hexahydro-benzo[e]isoindol-3-one | CHEMBL35053
Type:
Small organic molecule
Emp. Form.:
C14H17NO3
Mol. Mass.:
247.2897
SMILES:
COc1cc2CC[C@H]3[C@@H](CNC3=O)c2cc1OC
: