Target
cGMP-specific 3',5'-cyclic phosphodiesterase
Ligand
BDBM50017102
Substrate
Meas. Tech.
ChEBML_216657
IC50
>1000000±n/a nM
Citation
 Marivet, MCBourguignon, JJLugnier, CMann, AStoclet, JCWermuth, CG Inhibition of cyclic adenosine-3',5'-monophosphate phosphodiesterase from vascular smooth muscle by rolipram analogues. J Med Chem 32:1450-7 (1989)  
Target
Name:
cGMP-specific 3',5'-cyclic phosphodiesterase
Synonyms:
PDE5 PDE5A_BOVIN | Phosphodiesterase 5A
Type:
PROTEIN
Mol. Mass.:
98615.45
Organism:
Bos taurus
Description:
ChEMBL_155186
Residue:
865
  
Inhibitor
Name:
BDBM50017102
Synonyms:
4-(3-Butoxy-4-methoxy-phenyl)-pyrrolidin-2-one | CHEMBL35048
Type:
Small organic molecule
Emp. Form.:
C15H21NO3
Mol. Mass.:
263.3321
SMILES:
CCCCOc1cc(ccc1OC)C1CNC(=O)C1
: