Target
Bifunctional glucose-6-phosphate 1-dehydrogenase/6-phosphogluconolactonase
Ligand
BDBM50396489
Substrate
Meas. Tech.
ChEMBL_1731851 (CHEMBL4147387)
IC50
900±n/a nM
Citation
 Alencar, NSola, ILinares, MJuárez-Jiménez, JPont, CViayna, AVílchez, DSampedro, CAbad, PPérez-Benavente, SLameira, JBautista, JMMuñoz-Torrero, DLuque, FJ First homology model of Plasmodium falciparum glucose-6-phosphate dehydrogenase: Discovery of selective substrate analog-based inhibitors as novel antimalarial agents. Eur J Med Chem 146:108-122 (2018)  
Target
Name:
Bifunctional glucose-6-phosphate 1-dehydrogenase/6-phosphogluconolactonase
Synonyms:
6-phosphogluconolactonase G6PD GluPho PfGluPho
Type:
PROTEIN
Mol. Mass.:
106988.99
Organism:
Plasmodium falciparum (isolate 3D7)
Description:
ChEMBL_117865
Residue:
910
  
Inhibitor
Name:
BDBM50396489
Synonyms:
CHEMBL2170943
Type:
Small organic molecule
Emp. Form.:
C23H24FN3O2S
Mol. Mass.:
425.519
SMILES:
CCN1CCC[C@@H]1CNC(=O)c1ccc2S\C(=C/c3ccccc3F)C(=O)Nc2c1
: