Target
cAMP-specific 3',5'-cyclic phosphodiesterase 4D
Ligand
BDBM14769
Substrate
Meas. Tech.
ChEMBL_1731875 (CHEMBL4147411)
IC50
2000±n/a nM
Citation
 Barberot, CMoniot, AAllart-Simon, IMalleret, LYegorova, TLaronze-Cochard, MBentaher, AMédebielle, MBouillon, JPHénon, ESapi, JVelard, FGérard, S Synthesis and biological evaluation of pyridazinone derivatives as potential anti-inflammatory agents. Eur J Med Chem 146:139-146 (2018)  
Target
Name:
cAMP-specific 3',5'-cyclic phosphodiesterase 4D
Synonyms:
3',5'-cyclic phosphodiesterase PDE43 PDE4D_HUMAN | Phosphodiesterase 4D
Type:
Protein
Mol. Mass.:
91092.69
Organism:
Homo sapiens (Human)
Description:
Q08499
Residue:
809
  
Inhibitor
Name:
BDBM14769
Synonyms:
6-(3,4-Dimethoxy-phenyl)-4,5-dimethyl-4,5-dihydro-2H-pyridazin-3-one 6-(4-Difluoromethoxy-3-methoxy-phenyl)-2H-pyridazin-3-one CHEMBL313842 Zardaverine
Type:
Small organic molecule
Emp. Form.:
C12H10F2N2O3
Mol. Mass.:
268.2162
SMILES:
COc1cc(ccc1OC(F)F)-c1ccc(=O)[nH]n1
: