Target
Trace amine-associated receptor 5
Ligand
BDBM50292710
Substrate
Meas. Tech.
ChEMBL_1731932 (CHEMBL4147468)
EC50
>10000±n/a nM
Citation
 Guariento, STonelli, MEspinoza, SGerasimov, ASGainetdinov, RRCichero, E Rational design, chemical synthesis and biological evaluation of novel biguanides exploring species-specificity responsiveness of TAAR1 agonists. Eur J Med Chem 146:171-184 (2018)  
Target
Name:
Trace amine-associated receptor 5
Synonyms:
Gm227 TaR-5 Trace amine receptor 5 Trimethylamine receptor | mTaar5
Type:
PROTEIN
Mol. Mass.:
38230.08
Organism:
Mus musculus
Description:
ChEMBL_116770
Residue:
337
  
Inhibitor
Name:
BDBM50292710
Synonyms:
CHEMBL4161604
Type:
Small organic molecule
Emp. Form.:
C13H19Cl2F3N6
Mol. Mass.:
387.231
SMILES:
Cl.Cl.NC(=N)\N=C(/N)N1CCN(CC1)c1cccc(c1)C(F)(F)F
: