Target
Vascular endothelial growth factor receptor 2
Ligand
BDBM50297394
Substrate
Meas. Tech.
ChEMBL_1732103 (CHEMBL4147639)
IC50
21±n/a nM
Citation
 Qi, BYang, YHe, HYue, XZhou, YZhou, XChen, YLiu, MZhang, AWei, F Identification of novel N Eur J Med Chem 146:368-380 (2018)  
Target
Name:
Vascular endothelial growth factor receptor 2
Synonyms:
CD_antigen=CD309 Fetal liver kinase 1 (FLK-1) KDR Protein-tyrosine kinase receptor Flk-1 VEGFR-2 VEGFR2 Vascular Endothelial Growth Factor Receptor Kinase 2 Vascular endothelial growth factor receptor 2 (KDR) Vascular endothelial growth factor receptor 2 (VEGFR2) Vascular endothelial growth factor receptor-2 (VEGFR-2)
Type:
Receptor Tyrosine Kinase
Mol. Mass.:
151510.97
Organism:
Homo sapiens (Human)
Description:
P35968
Residue:
1356
  
Inhibitor
Name:
BDBM50297394
Synonyms:
CHEMBL4171115
Type:
Small organic molecule
Emp. Form.:
C33H32F3N5O5S
Mol. Mass.:
667.698
SMILES:
COc1cc2c(Oc3ccc(NC(=O)NN4C(SCC4=O)c4c(F)cccc4F)c(F)c3)ccnc2cc1OCCCN1CCCC1
: