Target
Histamine H1 receptor
Ligand
BDBM50017372
Substrate
Meas. Tech.
ChEBML_83773
IC50
63±n/a nM
Citation
 Walsh, DAFranzyshen, SKYanni, JM Synthesis and antiallergy activity of 4-(diarylhydroxymethyl)-1-[3-(aryloxy)propyl]piperidines and structurally related compounds. J Med Chem 32:105-18 (1989)  
Target
Name:
Histamine H1 receptor
Synonyms:
HISTAMINE H1 HRH1_CAVPO
Type:
G Protein-Coupled Receptor (GPCR)
Mol. Mass.:
55641.53
Organism:
Cavia porcellus (domestic guinea pig)
Description:
Guinea pig cerebellum was used in binding assay.
Residue:
488
  
Inhibitor
Name:
BDBM50017372
Synonyms:
4-(3-{4-[Bis-(4-fluoro-phenyl)-hydroxy-methyl]-piperidin-1-yl}-propoxy)-benzoic acid methyl ester | CHEMBL17237
Type:
Small organic molecule
Emp. Form.:
C29H31F2NO4
Mol. Mass.:
495.5575
SMILES:
COC(=O)c1ccc(OCCCN2CCC(CC2)C(O)(c2ccc(F)cc2)c2ccc(F)cc2)cc1
: