Target
Mu-type opioid receptor
Ligand
BDBM50017404
Substrate
Meas. Tech.
ChEBML_146550
Ki
7.5±n/a nM
Citation
 Bagley, JRWynn, RLRudo, FGDoorley, BMSpencer, HKSpaulding, T New 4-(heteroanilido)piperidines, structurally related to the pure opioid agonist fentanyl, with agonist and/or antagonist properties. J Med Chem 32:663-71 (1989)  
Target
Name:
Mu-type opioid receptor
Synonyms:
MOR-1 Mu-type opioid receptor (MOR) OPRM_RAT Opioid receptor B Ror-b
Type:
G Protein-Coupled Receptor (GPCR)
Mol. Mass.:
44503.11
Organism:
Rattus norvegicus (rat)
Description:
Competition binding assays were carried out using membrane preparations from transfected HN9.10 cells that constitutively expressed the mu opioid receptor.
Residue:
398
  
Inhibitor
Name:
BDBM50017404
Synonyms:
CHEMBL161084 Mirfentanil hydrochloride
Type:
Small organic molecule
Emp. Form.:
C22H24N4O2
Mol. Mass.:
376.4516
SMILES:
O=C(N(C1CCN(CCc2ccccc2)CC1)c1cnccn1)c1ccco1
: