Target
D(1A) dopamine receptor
Ligand
BDBM50017456
Substrate
Meas. Tech.
ChEMBL_58519 (CHEMBL672014)
Ki
>1000±n/a nM
Citation
 Martin, GEElgin, RJMathiasen, JRDavis, CBKesslick, JMBaldy, WJShank, RPDiStefano, DLFedde, CLScott, MK Activity of aromatic substituted phenylpiperazines lacking affinity for dopamine binding sites in a preclinical test of antipsychotic efficacy. J Med Chem 32:1052-6 (1989)  
Target
Name:
D(1A) dopamine receptor
Synonyms:
DOPAMINE D1 Dopamine D1 high Dopamine receptor Dopamine1-like Drd1a
Type:
Enzyme Catalytic Domain
Mol. Mass.:
49429.75
Organism:
RAT
Description:
P18901
Residue:
446
  
Inhibitor
Name:
BDBM50017456
Synonyms:
2-Piperazin-1-yl-phenol EN300-109720
Type:
Small organic molecule
Emp. Form.:
C10H14N2O
Mol. Mass.:
178.231
SMILES:
Oc1ccccc1N1CCNCC1
: