Target
Sigma non-opioid intracellular receptor 1
Ligand
BDBM50048866
Substrate
Meas. Tech.
ChEBML_1733119
Ki
14±n/a nM
Citation
 Sun, YTWang, GFYang, YQJin, FWang, YXie, XYMach, RHHuang, YS Synthesis and pharmacological evaluation of 6,7-dimethoxy-1,2,3,4-tetrahydroisoquinoline derivatives as sigma-2 receptor ligands. Eur J Med Chem 147:227-237 (2018)  
Target
Name:
Sigma non-opioid intracellular receptor 1
Synonyms:
Aging-associated gene 8 protein SGMR1_HUMAN SIGMAR1 SR31747-binding protein Sigma 1-type opioid receptor Sigma1R | hSigmaR1
Type:
Enzyme Catalytic Domain
Mol. Mass.:
25124.85
Organism:
Homo sapiens (Human)
Description:
Q99720
Residue:
223
  
Inhibitor
Name:
BDBM50048866
Synonyms:
1-Cyclohexyl-4-[3-(5-methoxy-1,2,3,4-tetrahydro-naphthalen-1-yl)-propyl]-piperazine 1-cyclohexyl-4-[3-(5-methoxy-1,2,3,4-tetrahydro-naphthalen-1-yl)propyl]piperazine CHEMBL53325 | PB-28
Type:
Small organic molecule
Emp. Form.:
C24H38N2O
Mol. Mass.:
370.5713
SMILES:
COc1cccc2C(CCCN3CCN(CC3)C3CCCCC3)CCCc12
: