Target
Carbonic anhydrase 9
Ligand
BDBM50341396
Substrate
Meas. Tech.
ChEMBL_1734320 (CHEMBL4149856)
Ki
2.4±n/a nM
Citation
 Angeli, Adi Cesare Mannelli, LTrallori, EPeat, TSGhelardini, CCarta, FSupuran, CT Design, Synthesis, and X-ray of Selenides as New Class of Agents for Prevention of Diabetic Cerebrovascular Pathology. ACS Med Chem Lett 9:462-467 (2018)  
Target
Name:
Carbonic anhydrase 9
Synonyms:
CA-IX CAH9_HUMAN Carbonic anhydrase 9 (CA IX) Carbonic anhydrase 9 precursor Carbonic anhydrase IX (CAIX) Carbonic anhydrases; II & IX MN RCC-associated antigen G250
Type:
Enzyme
Mol. Mass.:
49669.03
Organism:
Homo sapiens (Human)
Description:
Catalytic domain of human cloned isozyme was used in the assay
Residue:
459
  
Inhibitor
Name:
BDBM50341396
Synonyms:
CHEMBL4176433
Type:
Small organic molecule
Emp. Form.:
C8H11NO3SSe
Mol. Mass.:
280.2
SMILES:
[#7]S(=O)(=O)c1ccc([Se;v2][#6]-[#6]-[#8])cc1
: