Target
Carbonic anhydrase 5B, mitochondrial
Ligand
BDBM50341391
Substrate
Meas. Tech.
ChEMBL_1734318 (CHEMBL4149854)
Ki
5.5±n/a nM
Citation
 Angeli, Adi Cesare Mannelli, LTrallori, EPeat, TSGhelardini, CCarta, FSupuran, CT Design, Synthesis, and X-ray of Selenides as New Class of Agents for Prevention of Diabetic Cerebrovascular Pathology. ACS Med Chem Lett 9:462-467 (2018)  
Target
Name:
Carbonic anhydrase 5B, mitochondrial
Synonyms:
CA-VB CAH5B_HUMAN Carbonic Anhydrase VB Carbonic anhydrase 5B, mitochondrial Carbonic anhydrase V | Carbonic anhydrase VB (CA VB)
Type:
Enzyme
Mol. Mass.:
36440.83
Organism:
Homo sapiens (Human)
Description:
Human (cloned) isozyme
Residue:
317
  
Inhibitor
Name:
BDBM50341391
Synonyms:
CHEMBL4163634
Type:
Small organic molecule
Emp. Form.:
C9H13NO3SSe
Mol. Mass.:
294.23
SMILES:
[#6]-[#8]-[#6]-[#6][Se;v2]c1ccc(cc1)S([#7])(=O)=O
: